Reaction Details
TargetPhosphatidylinositol 4,5-bisphosphate 3-kinase catalytic subunit alpha isoform
LigandBDBM50355682
Substrate/Competitorn/a
Meas. Tech.ChEMBL_776272 (CHEMBL1914069)
IC50 4.80±n/a nM
Citation Rewcastle, GWGamage, SAFlanagan, JUFrederick, RDenny, WABaguley, BCKestell, PSingh, RKendall, JDMarshall, ESLill, CLLee, WJKolekar, SBuchanan, CMJamieson, SMShepherd, PR Synthesis and biological evaluation of novel analogues of the pan class I phosphatidylinositol 3-kinase (PI3K) inhibitor 2-(difluoromethyl)-1-[4,6-di(4-morpholinyl)-1,3,5-triazin-2-yl]-1H-benzimidazole (ZSTK474). J Med Chem54:7105-26 (2011) 
 
Phosphatidylinositol 4,5-bisphosphate 3-kinase catalytic subunit alpha isoform
Name:Phosphatidylinositol 4,5-bisphosphate 3-kinase catalytic subunit alpha isoform
Type:Enzyme Subunit
Mol. Mass.:124294.87
Organism:Homo sapiens (Human)
Description:P42336
Residue:1068
BDBM50355682
NameBDBM50355682
Synonyms:CHEMBL1911117
TypeSmall organic molecule
Emp. Form.C20H24F2N8O3
Mol. Mass.462.4532
SMILESCOc1cc(N)cc2n(c(nc12)C(F)F)-c1nc(nc(n1)N1CCOCC1)N1CCOCC1