Reaction Details
TargetGlucocorticoid receptor
LigandBDBM50355730
Substrate/Competitorn/a
Meas. Tech.ChEMBL_776305 (CHEMBL1914150)
Ki 1.64±n/a nM
Citation Weinstein, DSGong, HDoweyko, AMCunningham, MHabte, SWang, JHHolloway, DABurke, CGao, LGuarino, VCarman, JSomerville, JEShuster, DSalter-Cid, LDodd, JHNadler, SGBarrish, JC Azaxanthene based selective glucocorticoid receptor modulators: design, synthesis, and pharmacological evaluation of (S)-4-(5-(1-((1,3,4-thiadiazol-2-yl)amino)-2-methyl-1-oxopropan-2-yl)-5H-chromeno[2,3-b]pyridin-2-yl)-2-fluoro-N,N-dimethylbenzamide (BMS-776532) and its methylene homologue (BMS-791 J Med Chem54:7318-33 (2011) 
 
Glucocorticoid receptor
Name:Glucocorticoid receptor
Type:Enzyme
Mol. Mass.:85656.87
Organism:Homo sapiens (Human)
Description:P04150
Residue:777
BDBM50355730
NameBDBM50355730
Synonyms:CHEMBL1911274
TypeSmall organic molecule
Emp. Form.C28H26FN5O3S
Mol. Mass.531.601
SMILESCCN(C)C(=O)c1ccc(cc1F)-c1ccc2[C@@H](c3ccccc3Oc2n1)C(C)(C)C(=O)Nc1nncs1