Reaction Details
TargetGlucocorticoid receptor
LigandBDBM50348401
Substrate/Competitorn/a
Meas. Tech.ChEMBL_776305 (CHEMBL1914150)
Ki 1.2±n/a nM
Citation Weinstein, DSGong, HDoweyko, AMCunningham, MHabte, SWang, JHHolloway, DABurke, CGao, LGuarino, VCarman, JSomerville, JEShuster, DSalter-Cid, LDodd, JHNadler, SGBarrish, JC Azaxanthene based selective glucocorticoid receptor modulators: design, synthesis, and pharmacological evaluation of (S)-4-(5-(1-((1,3,4-thiadiazol-2-yl)amino)-2-methyl-1-oxopropan-2-yl)-5H-chromeno[2,3-b]pyridin-2-yl)-2-fluoro-N,N-dimethylbenzamide (BMS-776532) and its methylene homologue (BMS-791 J Med Chem54:7318-33 (2011) 
 
Glucocorticoid receptor
Name:Glucocorticoid receptor
Type:Enzyme
Mol. Mass.:85656.87
Organism:Homo sapiens (Human)
Description:P04150
Residue:777
BDBM50348401
NameBDBM50348401
Synonyms:CHEMBL1801012
TypeSmall organic molecule
Emp. Form.C20H20N2O2S
Mol. Mass.352.45
SMILESCC(C)([C@@H](c1ccccc1)c1ccc(O)cc1)C(=O)Nc1nccs1