Reaction Details
TargetTranslocator protein
LigandBDBM50355781
Substrate/Competitorn/a
Meas. Tech.ChEMBL_776493 (CHEMBL1913590)
IC50 0.14±n/a nM
Citation Cappelli, ABini, GValenti, SGiuliani, GPaolino, MAnzini, MVomero, SGiorgi, GGiordani, AStasi, LPMakovec, FGhelardini, CDi Cesare Mannelli, LConcas, APorcu, PBiggio, G Synthesis and structure-activity relationship studies in translocator protein ligands based on a pyrazolo[3,4-b]quinoline scaffold. J Med Chem54:7165-75 (2011) 
 
Translocator protein
Name:Translocator protein
Type:Mitochondrion membrane protein
Mol. Mass.:18945.84
Organism:Rattus norvegicus (rat)
Description:Competitive binding experiments were performed on rat kidney mitochondrial membranes.
Residue:169
BDBM50355781
NameBDBM50355781
Synonyms:CHEMBL1911620
TypeSmall organic molecule
Emp. Form.C24H26N4O2
Mol. Mass.402.4888
SMILESCCCCN(C)C(=O)Cn1c2nn(-c3ccccc3)c(=O)c2c(C)c2ccccc12