Reaction Details
TargetMaltase-glucoamylase
LigandBDBM50327504
Substrate/Competitorn/a
Meas. Tech.ChEMBL_775166 (CHEMBL1912471)
Ki 500±n/a nM
Citation Eskandari, RJones, KRose, DRPinto, BM Selectivity of 3'-O-methylponkoranol for inhibition of N- and C-terminal maltase glucoamylase and sucrase isomaltase, potential therapeutics for digestive disorders or their sequelae. Bioorg Med Chem Lett21:6491-4 (2011) 
 
Maltase-glucoamylase
Name:Maltase-glucoamylase
Type:Enzyme
Mol. Mass.:209817.06
Organism:Homo sapiens (Human)
Description:O43451
Residue:1857
BDBM50327504
NameBDBM50327504
Synonyms:1,4-Dideoxy-1,4-[[2S,3S,4R,5S]-2,4,5,6-tetrahydroxy-3-(methyl)hexyl]-(R)-epi-sulfoniumylidine]-D-arabinitol chloride | CHEMBL1258644
TypeSmall organic molecule
Emp. Form.C12H25O8S
Mol. Mass.329.387
SMILESCO[C@H]([C@H](O)C[S@@+]1C[C@@H](O)[C@H](O)[C@H]1CO)[C@H](O)[C@@H](O)CO