Reaction Details
TargetCannabinoid receptor 2
LigandBDBM50312599
Substrate/Competitorn/a
Meas. Tech.ChEMBL_775756 (CHEMBL1912190)
Ki 329±n/a nM
Citation Gao, LLi, MMeng, TPeng, HXie, XZhang, YJin, YWang, XZou, LShen, J Asymmetric synthesis and biological evaluation of N-cyclohexyl-4-[1-(2,4-dichlorophenyl)-1-(p-tolyl)methyl]piperazine-1-carboxamide as hCB1 receptor antagonists. Eur J Med Chem46:5310-6 (2011) 
 
Cannabinoid receptor 2
Name:Cannabinoid receptor 2
Type:G Protein-Coupled Receptor (GPCR)
Mol. Mass.:39690.94
Organism:Homo sapiens (Human)
Description:P34972
Residue:360
BDBM50312599
NameBDBM50312599
Synonyms:CHEMBL1093735 | N-Cyclohexyl-4-[(2,4-dichlorophenyl)(p-tolyl)methyl]piperazine-1-carboxamide
TypeSmall organic molecule
Emp. Form.C25H31Cl2N3O
Mol. Mass.460.439
SMILESCc1ccc(cc1)C(N1CCN(CC1)C(=O)NC1CCCCC1)c1ccc(Cl)cc1Cl