Reaction Details
TargetCyclin-dependent kinase 5 activator 1
LigandBDBM50355916
Substrate/Competitorn/a
Meas. Tech.ChEMBL_775907 (CHEMBL1912880)
IC50 830±n/a nM
Citation Kassis, PBrzeszcz, JBénéteau, VLozach, OMeijer, LLe Guével, RGuillouzo, CLewinski, KBourg, SColliandre, LRoutier, SMérour, JY Synthesis and biological evaluation of new 3-(6-hydroxyindol-2-yl)-5-(Phenyl) pyridine or pyrazine V-Shaped molecules as kinase inhibitors and cytotoxic agents. Eur J Med Chem46:5416-34 (2011) 
 
Cyclin-dependent kinase 5 activator 1
Name:Cyclin-dependent kinase 5 activator 1
Type:Protein Complex
Mol. Mass.:n/a
Description:n/a
Components:This complex has 2 components.
Component 1
Name:Cyclin-dependent kinase 5
Synonyms:CDK5 CDKN5 Cyclin-dependent kinase 5 (CDK5/ p25) Cyclin-dependent-like kinase 5 PSSALRE Tau protein kinase II catalytic subunit
Type:Enzyme Subunit
Mol. Mass.:33308.61
Organism:Homo sapiens (Human)
Description:n/a
Residue:292
Component 2
Name:Cyclin-dependent kinase 5 activator 1
Synonyms:CD5R1_HUMAN CDK5R1 Cyclin-dependent kinase 5 (CDK5/p25) NCK5A p35
Type:Enzyme Subunit
Mol. Mass.:34077.43
Organism:Homo sapiens (Human)
Description:Q15078
Residue:307
BDBM50355916
NameBDBM50355916
Synonyms:CHEMBL1910377
TypeSmall organic molecule
Emp. Form.C19H14N2O2
Mol. Mass.302.3267
SMILESOc1ccc(cc1)-c1ccnc(c1)-c1cc2ccc(O)cc2[nH]1