Reaction Details
TargetAcetyl-CoA carboxylase 2
LigandBDBM50355926
Substrate/Competitorn/a
Meas. Tech.ChEMBL_775975 (CHEMBL1912973)
IC50 750±n/a nM
Citation Yamashita, TKamata, MEndo, SYamamoto, MKakegawa, KWatanabe, HMiwa, KYamano, TFunata, MSakamoto, JTani, AMol, CDZou, HDougan, DRSang, BSnell, GFukatsu, K Design, synthesis, and structure-activity relationships of spirolactones bearing 2-ureidobenzothiophene as acetyl-CoA carboxylases inhibitors. Bioorg Med Chem Lett21:6314-8 (2011) 
 
Acetyl-CoA carboxylase 2
Name:Acetyl-CoA carboxylase 2
Type:Protein
Mol. Mass.:276535.21
Organism:Homo sapiens (Human)
Description:O00763
Residue:2458
BDBM50355926
NameBDBM50355926
Synonyms:CHEMBL1910396
TypeSmall organic molecule
Emp. Form.C24H31N3O3S
Mol. Mass.441.586
SMILESCC1(C)CC2(CCCN(C2)C2CCN(CC2)C(=O)c2c(N)sc3ccccc23)C(=O)O1