Reaction Details
TargetAcetyl-CoA carboxylase 1
LigandBDBM50355927
Substrate/Competitorn/a
Meas. Tech.ChEMBL_775974 (CHEMBL1912972)
IC50 2000±n/a nM
Citation Yamashita, TKamata, MEndo, SYamamoto, MKakegawa, KWatanabe, HMiwa, KYamano, TFunata, MSakamoto, JTani, AMol, CDZou, HDougan, DRSang, BSnell, GFukatsu, K Design, synthesis, and structure-activity relationships of spirolactones bearing 2-ureidobenzothiophene as acetyl-CoA carboxylases inhibitors. Bioorg Med Chem Lett21:6314-8 (2011) 
 
Acetyl-CoA carboxylase 1
Name:Acetyl-CoA carboxylase 1
Type:Protein
Mol. Mass.:265543.22
Organism:Homo sapiens (Human)
Description:Q13085
Residue:2346
BDBM50355927
NameBDBM50355927
Synonyms:CHEMBL1910397
TypeSmall organic molecule
Emp. Form.C26H33N3O4S
Mol. Mass.483.623
SMILESCC(=O)Nc1sc2ccccc2c1C(=O)N1CCC(CC1)N1CCCC2(CC(C)(C)OC2=O)C1