Reaction Details
TargetAcetyl-CoA carboxylase 2
LigandBDBM50355927
Substrate/Competitorn/a
Meas. Tech.ChEMBL_775975 (CHEMBL1912973)
IC50 100±n/a nM
Citation Yamashita, TKamata, MEndo, SYamamoto, MKakegawa, KWatanabe, HMiwa, KYamano, TFunata, MSakamoto, JTani, AMol, CDZou, HDougan, DRSang, BSnell, GFukatsu, K Design, synthesis, and structure-activity relationships of spirolactones bearing 2-ureidobenzothiophene as acetyl-CoA carboxylases inhibitors. Bioorg Med Chem Lett21:6314-8 (2011) 
 
Acetyl-CoA carboxylase 2
Name:Acetyl-CoA carboxylase 2
Type:Protein
Mol. Mass.:276535.21
Organism:Homo sapiens (Human)
Description:O00763
Residue:2458
BDBM50355927
NameBDBM50355927
Synonyms:CHEMBL1910397
TypeSmall organic molecule
Emp. Form.C26H33N3O4S
Mol. Mass.483.623
SMILESCC(=O)Nc1sc2ccccc2c1C(=O)N1CCC(CC1)N1CCCC2(CC(C)(C)OC2=O)C1