Reaction Details
TargetAcetyl-CoA carboxylase 1
LigandBDBM50355928
Substrate/Competitorn/a
Meas. Tech.ChEMBL_775974 (CHEMBL1912972)
IC50 84±n/a nM
Citation Yamashita, TKamata, MEndo, SYamamoto, MKakegawa, KWatanabe, HMiwa, KYamano, TFunata, MSakamoto, JTani, AMol, CDZou, HDougan, DRSang, BSnell, GFukatsu, K Design, synthesis, and structure-activity relationships of spirolactones bearing 2-ureidobenzothiophene as acetyl-CoA carboxylases inhibitors. Bioorg Med Chem Lett21:6314-8 (2011) 
 
Acetyl-CoA carboxylase 1
Name:Acetyl-CoA carboxylase 1
Type:Protein
Mol. Mass.:265543.22
Organism:Homo sapiens (Human)
Description:Q13085
Residue:2346
BDBM50355928
NameBDBM50355928
Synonyms:CHEMBL1910398
TypeSmall organic molecule
Emp. Form.C25H32N4O4S
Mol. Mass.484.611
SMILESCC1(C)CC2(CCCN(C2)C2CCN(CC2)C(=O)c2c(NC(N)=O)sc3ccccc23)C(=O)O1