Reaction Details
TargetMineralocorticoid receptor
LigandBDBM50355936
Substrate/Competitorn/a
Meas. Tech.ChEMBL_775983 (CHEMBL1912981)
IC50 14000±n/a nM
Citation Nagata, NMiyakawa, MAmano, SFuruya, KYamamoto, NNejishima, HInoguchi, K Tetrahydroquinolines as a novel series of nonsteroidal selective androgen receptor modulators: structural requirements for better physicochemical and biological properties. Bioorg Med Chem Lett21:6310-3 (2011) 
 
Mineralocorticoid receptor
Name:Mineralocorticoid receptor
Type:Enzyme Catalytic Domain
Mol. Mass.:106748.15
Organism:RAT
Description:mineralocorticoid 0 RAT::P22199
Residue:981
BDBM50355936
NameBDBM50355936
Synonyms:CHEMBL1910411
TypeSmall organic molecule
Emp. Form.C15H23N3O3
Mol. Mass.293.3614
SMILESCN(C)[C@H]1C[C@H](Nc2ccc(cc12)[N+]([O-])=O)C(C)(C)CO