Reaction Details
TargetMineralocorticoid receptor
LigandBDBM18525
Substrate/Competitorn/a
Meas. Tech.ChEMBL_775983 (CHEMBL1912981)
IC50 360000±n/a nM
Citation Nagata, NMiyakawa, MAmano, SFuruya, KYamamoto, NNejishima, HInoguchi, K Tetrahydroquinolines as a novel series of nonsteroidal selective androgen receptor modulators: structural requirements for better physicochemical and biological properties. Bioorg Med Chem Lett21:6310-3 (2011) 
 
Mineralocorticoid receptor
Name:Mineralocorticoid receptor
Type:Enzyme Catalytic Domain
Mol. Mass.:106748.15
Organism:RAT
Description:mineralocorticoid 0 RAT::P22199
Residue:981
BDBM18525
NameBDBM18525
Synonyms:Bicalutamide N-[4-cyano-3-(trifluoromethyl)phenyl]-3-[(4-fluorobenzene)sulfonyl]-2-hydroxy-2-methylpropanamide US20230382870, Bicalutumide US9682960, CAS
TypeSmall organic molecule
Emp. Form.C18H14F4N2O4S
Mol. Mass.430.373
SMILESCC(O)(CS(=O)(=O)c1ccc(F)cc1)C(=O)Nc1ccc(C#N)c(c1)C(F)(F)F