Reaction Details
TargetAndrogen receptor
LigandBDBM50338693
Substrate/Competitorn/a
Meas. Tech.ChEMBL_775977 (CHEMBL1912975)
EC50 2.3±n/a nM
Citation Nagata, NMiyakawa, MAmano, SFuruya, KYamamoto, NNejishima, HInoguchi, K Tetrahydroquinolines as a novel series of nonsteroidal selective androgen receptor modulators: structural requirements for better physicochemical and biological properties. Bioorg Med Chem Lett21:6310-3 (2011) 
 
Androgen receptor
Name:Androgen receptor
Type:Enzyme
Mol. Mass.:98219.08
Organism:Rattus norvegicus (Rat)
Description:P15207
Residue:902
BDBM50338693
NameBDBM50338693
Synonyms:2-methyl-2-((3aR,4S,9bS)-8-nitro-3a,4,5,9b-tetrahydro-3H-cyclopenta[c]quinolin-4-yl)propan-1-ol | CHEMBL1684194
TypeSmall organic molecule
Emp. Form.C16H20N2O3
Mol. Mass.288.3416
SMILESCC(C)(CO)[C@H]1Nc2ccc(cc2[C@H]2C=CC[C@@H]12)[N+]([O-])=O