Reaction Details
TargetAndrogen receptor
LigandBDBM50355942
Substrate/Competitorn/a
Meas. Tech.ChEMBL_775977 (CHEMBL1912975)
EC50 810±n/a nM
Citation Nagata, NMiyakawa, MAmano, SFuruya, KYamamoto, NNejishima, HInoguchi, K Tetrahydroquinolines as a novel series of nonsteroidal selective androgen receptor modulators: structural requirements for better physicochemical and biological properties. Bioorg Med Chem Lett21:6310-3 (2011) 
 
Androgen receptor
Name:Androgen receptor
Type:Enzyme
Mol. Mass.:98219.08
Organism:Rattus norvegicus (Rat)
Description:P15207
Residue:902
BDBM50355942
NameBDBM50355942
Synonyms:CHEMBL1910410
TypeSmall organic molecule
Emp. Form.C19H31N3O3
Mol. Mass.349.4677
SMILESCCCN(CCC)[C@H]1C[C@H](Nc2ccc(cc12)[N+]([O-])=O)C(C)(C)CO