Reaction Details
TargetAndrogen receptor
LigandBDBM50355950
Substrate/Competitorn/a
Meas. Tech.ChEMBL_775978 (CHEMBL1912976)
IC50 8000±n/a nM
Citation Nagata, NMiyakawa, MAmano, SFuruya, KYamamoto, NNejishima, HInoguchi, K Tetrahydroquinolines as a novel series of nonsteroidal selective androgen receptor modulators: structural requirements for better physicochemical and biological properties. Bioorg Med Chem Lett21:6310-3 (2011) 
 
Androgen receptor
Name:Androgen receptor
Type:Enzyme
Mol. Mass.:98219.08
Organism:Rattus norvegicus (Rat)
Description:P15207
Residue:902
BDBM50355950
NameBDBM50355950
Synonyms:CHEMBL1910419
TypeSmall organic molecule
Emp. Form.C19H22N2O3S
Mol. Mass.358.455
SMILESCC(C)(CO)[C@@H]1C[C@H](Sc2ccccc2)c2cc(ccc2N1)[N+]([O-])=O