Reaction Details
TargetGlucocorticoid receptor
LigandBDBM50356058
Substrate/Competitorn/a
Meas. Tech.ChEMBL_775646 (CHEMBL1913330)
IC50 32±n/a nM
Citation Betageri, RGilmore, TKuzmich, DKirrane, TMBentzien, JWiedenmayer, DBekkali, YRegan, JBerry, ALatli, BKukulka, AJFadra, TNNelson, RMGoldrick, SZuvela-Jelaska, LSouza, DPelletier, JDinallo, RPanzenbeck, MTorcellini, CLee, HPack, EHarcken, CNabozny, GThomson, DS Non-steroidal dissociated glucocorticoid agonists: indoles as A-ring mimetics and function-regulating pharmacophores. Bioorg Med Chem Lett21:6842-51 (2011) 
 
Glucocorticoid receptor
Name:Glucocorticoid receptor
Type:Enzyme
Mol. Mass.:85656.87
Organism:Homo sapiens (Human)
Description:P04150
Residue:777
BDBM50356058
NameBDBM50356058
Synonyms:CHEMBL1911658
TypeSmall organic molecule
Emp. Form.C23H23BrF3NO2
Mol. Mass.482.333
SMILESCC(C)(CC(O)(Cc1cc2ccccc2[nH]1)C(F)(F)F)c1cc(Br)cc2CCOc12