Reaction Details
TargetGlucocorticoid receptor
LigandBDBM50356050
Substrate/Competitorn/a
Meas. Tech.ChEMBL_775652 (CHEMBL1913336)
IC50 3±n/a nM
Citation Betageri, RGilmore, TKuzmich, DKirrane, TMBentzien, JWiedenmayer, DBekkali, YRegan, JBerry, ALatli, BKukulka, AJFadra, TNNelson, RMGoldrick, SZuvela-Jelaska, LSouza, DPelletier, JDinallo, RPanzenbeck, MTorcellini, CLee, HPack, EHarcken, CNabozny, GThomson, DS Non-steroidal dissociated glucocorticoid agonists: indoles as A-ring mimetics and function-regulating pharmacophores. Bioorg Med Chem Lett21:6842-51 (2011) 
 
Glucocorticoid receptor
Name:Glucocorticoid receptor
Type:Enzyme
Mol. Mass.:85656.87
Organism:Homo sapiens (Human)
Description:P04150
Residue:777
BDBM50356050
NameBDBM50356050
Synonyms:CHEMBL1911650
TypeSmall organic molecule
Emp. Form.C23H22F4N2O2
Mol. Mass.434.4266
SMILESCOc1ccc(F)cc1C(C)(C)C[C@@](O)(Cc1cc2cc(ccc2[nH]1)C#N)C(F)(F)F