Reaction Details
TargetCeramide glucosyltransferase
LigandBDBM50356066
Substrate/Competitorn/a
Meas. Tech.ChEMBL_775862 (CHEMBL1912403)
IC50 5±n/a nM
Citation Koltun, ERichards, SChan, VNachtigall, JDu, HNoson, KGalan, AAay, NHanel, AHarrison, AZhang, JWon, KATam, DQian, FWang, TFinn, POgilvie, KRosen, JMohan, RLarson, CLamb, PNuss, JKearney, P Discovery of a new class of glucosylceramide synthase inhibitors. Bioorg Med Chem Lett21:6773-7 (2011) 
 
Ceramide glucosyltransferase
Name:Ceramide glucosyltransferase
Type:PROTEIN
Mol. Mass.:44859.25
Organism:Homo sapiens (Human)
Description:ChEMBL_1435474
Residue:394
BDBM50356066
NameBDBM50356066
Synonyms:CHEMBL1911827
TypeSmall organic molecule
Emp. Form.C28H28ClF3N4O4
Mol. Mass.576.995
SMILESCN[C@@H]1CCN(C1)C(=O)[C@@H](COCc1ccccc1)NC(=O)c1cccnc1Oc1ccc(cc1Cl)C(F)(F)F