Reaction Details
TargetCeramide glucosyltransferase
LigandBDBM50356067
Substrate/Competitorn/a
Meas. Tech.ChEMBL_775861 (CHEMBL1912402)
IC50 10±n/a nM
Citation Koltun, ERichards, SChan, VNachtigall, JDu, HNoson, KGalan, AAay, NHanel, AHarrison, AZhang, JWon, KATam, DQian, FWang, TFinn, POgilvie, KRosen, JMohan, RLarson, CLamb, PNuss, JKearney, P Discovery of a new class of glucosylceramide synthase inhibitors. Bioorg Med Chem Lett21:6773-7 (2011) 
 
Ceramide glucosyltransferase
Name:Ceramide glucosyltransferase
Type:PROTEIN
Mol. Mass.:44859.25
Organism:Homo sapiens (Human)
Description:ChEMBL_1435474
Residue:394
BDBM50356067
NameBDBM50356067
Synonyms:CHEMBL1911826
TypeSmall organic molecule
Emp. Form.C29H30ClF3N4O4
Mol. Mass.591.021
SMILESCN(C)[C@@H]1CCN(C1)C(=O)[C@@H](COCc1ccccc1)NC(=O)c1cccnc1Oc1ccc(cc1Cl)C(F)(F)F