Reaction Details
TargetBeta-galactosidase
LigandBDBM50182795
Substrate/Competitorn/a
Meas. Tech.ChEMBL_775922 (CHEMBL1912895)
Ki 300±n/a nM
Citation Fröhlich, RFFantur, KFurneaux, RHPaschke, EStütz, AEWicki, JWithers, SGWrodnigg, TM A fluorescent probe for GM1 gangliosidosis relatedß-galactosidase: N-(dansylamino)hexylaminocarbonylpentyl-1,5-dideoxy-1,5-imino-D-galactitol. Bioorg Med Chem Lett21:6872-5 (2011) 
 
Beta-galactosidase
Name:Beta-galactosidase
Type:PROTEIN
Mol. Mass.:76074.43
Organism:Homo sapiens (Human)
Description:ChEMBL_215886
Residue:677
BDBM50182795
NameBDBM50182795
Synonyms:5-(dimethylamino)-N-(6-((2R,3S,4R,5S)-3,4,5-trihydroxy-2-(hydroxymethyl)piperidin-1-yl)hexyl)naphthalene-1-sulfonamide | CHEMBL205982
TypeSmall organic molecule
Emp. Form.C24H37N3O6S
Mol. Mass.495.632
SMILESCN(C)c1cccc2c(cccc12)S(=O)(=O)NCCCCCCN1C[C@H](O)[C@@H](O)[C@@H](O)[C@H]1CO