Reaction Details
TargetBeta-galactosidase
LigandBDBM50246569
Substrate/Competitorn/a
Meas. Tech.ChEMBL_775922 (CHEMBL1912895)
Ki 600±n/a nM
Citation Fröhlich, RFFantur, KFurneaux, RHPaschke, EStütz, AEWicki, JWithers, SGWrodnigg, TM A fluorescent probe for GM1 gangliosidosis relatedß-galactosidase: N-(dansylamino)hexylaminocarbonylpentyl-1,5-dideoxy-1,5-imino-D-galactitol. Bioorg Med Chem Lett21:6872-5 (2011) 
 
Beta-galactosidase
Name:Beta-galactosidase
Type:PROTEIN
Mol. Mass.:76074.43
Organism:Homo sapiens (Human)
Description:ChEMBL_215886
Residue:677
BDBM50246569
NameBDBM50246569
Synonyms:CHEMBL505422 | Methyl 6-[N2-dansyl-N6-(1,5-dideoxy-D-galactitol-1,5-diyl)-L-lysinyl]amino hexanoate
TypeSmall organic molecule
Emp. Form.C31H48N4O9S
Mol. Mass.652.799
SMILESCOC(=O)CCCCCNC(=O)[C@H](CCCCN1C[C@H](O)[C@@H](O)[C@@H](O)[C@H]1CO)NS(=O)(=O)c1cccc2c(cccc12)N(C)C