Reaction Details
TargetTranscriptional activator protein LuxR
LigandBDBM50356106
Substrate/Competitorn/a
Meas. Tech.ChEMBL_775933 (CHEMBL1912676)
IC50 40000±n/a nM
Citation Boukraa, MSabbah, MSoulère, LEl Efrit, MLQueneau, YDoutheau, A AHL-dependent quorum sensing inhibition: synthesis and biological evaluation ofa-(N-alkyl-carboxamide)-¿-butyrolactones anda-(N-alkyl-sulfonamide)-¿-butyrolactones. Bioorg Med Chem Lett21:6876-9 (2011) 
 
Transcriptional activator protein LuxR
Name:Transcriptional activator protein LuxR
Type:PROTEIN
Mol. Mass.:28563.86
Organism:Vibrio fischeri
Description:ChEMBL_831639
Residue:250
BDBM50356106
NameBDBM50356106
Synonyms:CHEMBL1911959
TypeSmall organic molecule
Emp. Form.C11H19NO2
Mol. Mass.197.2741
SMILESCCCCCNC(=O)C1CCCC1=O