Reaction Details
TargetCollagenase 3
LigandBDBM50356213
Substrate/Competitorn/a
Meas. Tech.ChEMBL_774908 (CHEMBL1913353)
IC50 4.6±n/a nM
Citation Hu, YXing, LThomason, JRXiang, JIpek, MGuler, SLi, HSabatini, JChockalingam, PReifenberg, ESheldon, RMorris, EAGeorgiadis, KETam, S Continued exploration of biphenylsulfonamide scaffold as a platform for aggrecanase-1 inhibition. Bioorg Med Chem Lett21:6800-3 (2011) 
 
Collagenase 3
Name:Collagenase 3
Type:Enzyme
Mol. Mass.:53808.06
Organism:Homo sapiens (Human)
Description:P45452
Residue:471
BDBM50356213
NameBDBM50356213
Synonyms:CHEMBL1910470
TypeSmall organic molecule
Emp. Form.C25H24N2O5S
Mol. Mass.464.533
SMILESCC(C)[C@@H](NS(=O)(=O)c1ccc(cc1)-c1ccc(OCc2ccccc2C#N)cc1)C(O)=O