Reaction Details
TargetCollagenase 3
LigandBDBM24047
Substrate/Competitorn/a
Meas. Tech.ChEMBL_774908 (CHEMBL1913353)
IC50 4±n/a nM
Citation Hu, YXing, LThomason, JRXiang, JIpek, MGuler, SLi, HSabatini, JChockalingam, PReifenberg, ESheldon, RMorris, EAGeorgiadis, KETam, S Continued exploration of biphenylsulfonamide scaffold as a platform for aggrecanase-1 inhibition. Bioorg Med Chem Lett21:6800-3 (2011) 
 
Collagenase 3
Name:Collagenase 3
Type:Enzyme
Mol. Mass.:53808.06
Organism:Homo sapiens (Human)
Description:P45452
Residue:471
BDBM24047
NameBDBM24047
Synonyms:(2R)-3-methyl-2-[(4-{4-[(3-methyl-1-benzofuran-2-yl)methoxy]phenyl}benzene)sulfonamido]butanoic acid | biphenylsulfonamide carboxylate, 24
TypeSmall organic molecule
Emp. Form.C27H27NO6S
Mol. Mass.493.571
SMILESCC(C)[C@@H](NS(=O)(=O)c1ccc(cc1)-c1ccc(OCc2oc3ccccc3c2C)cc1)C(O)=O