Reaction Details
TargetSphingosine 1-phosphate receptor 4
LigandBDBM50356264
Substrate/Competitorn/a
Meas. Tech.ChEMBL_774916 (CHEMBL1913361)
EC50 104±n/a nM
Citation Urbano, MGuerrero, MVelaparthi, SCrisp, MChase, PHodder, PSchaeffer, MTBrown, SRosen, HRoberts, E Discovery, synthesis and SAR analysis of novel selective small molecule S1P4-R agonists based on a (2Z,5Z)-5-((pyrrol-3-yl)methylene)-3-alkyl-2-(alkylimino)thiazolidin-4-one chemotype. Bioorg Med Chem Lett21:6739-45 (2011) 
 
Sphingosine 1-phosphate receptor 4
Name:Sphingosine 1-phosphate receptor 4
Type:G Protein-Coupled Receptor (GPCR)
Mol. Mass.:41647.39
Organism:Homo sapiens (Human)
Description:n/a
Residue:384
BDBM50356264
NameBDBM50356264
Synonyms:CHEMBL1910800
TypeSmall organic molecule
Emp. Form.C20H21F2N3OS
Mol. Mass.389.462
SMILESCC\N=C1/S\C(=C/c2cc(C)n(c2C)-c2ccc(F)cc2F)C(=O)N1CC