Reaction Details
TargetCalcitonin gene-related peptide 1
LigandBDBM50356287
Substrate/Competitorn/a
Meas. Tech.ChEMBL_775006 (CHEMBL1912161)
Ki 1900±n/a nM
Citation Zartman, CBBell, IMGallicchio, SNGraham, SLKane, SAMallee, JJRutledge, RZSalvatore, CAVacca, JPWilliams, TM Identification of a novel RAMP-independent CGRP receptor antagonist. Bioorg Med Chem Lett21:6705-8 (2011) 
 
Calcitonin gene-related peptide 1
Name:Calcitonin gene-related peptide 1
Type:Enzyme
Mol. Mass.:13902.80
Organism:Homo sapiens (Human)
Description:P06881
Residue:128
BDBM50356287
NameBDBM50356287
Synonyms:CHEMBL1910941
TypeSmall organic molecule
Emp. Form.C20H18F2N4O4S
Mol. Mass.448.443
SMILESOc1c(nc(N2CCCCS2(=O)=O)c2cccnc12)C(=O)NCc1cc(F)cc(F)c1