Reaction Details
TargetCalcitonin gene-related peptide 1
LigandBDBM50356278
Substrate/Competitorn/a
Meas. Tech.ChEMBL_775006 (CHEMBL1912161)
Ki 3300±n/a nM
Citation Zartman, CBBell, IMGallicchio, SNGraham, SLKane, SAMallee, JJRutledge, RZSalvatore, CAVacca, JPWilliams, TM Identification of a novel RAMP-independent CGRP receptor antagonist. Bioorg Med Chem Lett21:6705-8 (2011) 
 
Calcitonin gene-related peptide 1
Name:Calcitonin gene-related peptide 1
Type:Enzyme
Mol. Mass.:13902.80
Organism:Homo sapiens (Human)
Description:P06881
Residue:128
BDBM50356278
NameBDBM50356278
Synonyms:CHEMBL1910947
TypeSmall organic molecule
Emp. Form.C17H16BrF2N3O4S
Mol. Mass.476.292
SMILESOc1c(Br)cc(nc1C(=O)NCc1cc(F)cc(F)c1)N1CCCCS1(=O)=O