Reaction Details
TargetCalcitonin gene-related peptide 1
LigandBDBM50356284
Substrate/Competitorn/a
Meas. Tech.ChEMBL_775006 (CHEMBL1912161)
Ki 14000±n/a nM
Citation Zartman, CBBell, IMGallicchio, SNGraham, SLKane, SAMallee, JJRutledge, RZSalvatore, CAVacca, JPWilliams, TM Identification of a novel RAMP-independent CGRP receptor antagonist. Bioorg Med Chem Lett21:6705-8 (2011) 
 
Calcitonin gene-related peptide 1
Name:Calcitonin gene-related peptide 1
Type:Enzyme
Mol. Mass.:13902.80
Organism:Homo sapiens (Human)
Description:P06881
Residue:128
BDBM50356284
NameBDBM50356284
Synonyms:CHEMBL1910938
TypeSmall organic molecule
Emp. Form.C19H19N5O4S
Mol. Mass.413.45
SMILESOc1c(nc(N2CCCCS2(=O)=O)c2cccnc12)C(=O)NCc1cccnc1