Reaction Details
Target11-beta-hydroxysteroid dehydrogenase 1
LigandBDBM50356334
Substrate/Competitorn/a
Meas. Tech.ChEMBL_775369 (CHEMBL1912854)
IC50 2.2±n/a nM
Citation Ye, XYChen, SYNayeem, AGolla, RSeethala, RWang, MHarper, TSleczka, BGLi, YXHe, BKirby, MGordon, DARobl, JA Design, synthesis, and SAR studies of novel polycyclic acids as potent and selective inhibitors of human 11ß-hydroxysteroid dehydrogenase type 1 (11ß-HSD-1). Bioorg Med Chem Lett21:6699-704 (2011) 
 
11-beta-hydroxysteroid dehydrogenase 1
Name:11-beta-hydroxysteroid dehydrogenase 1
Type:Enzyme
Mol. Mass.:32409.16
Organism:Homo sapiens (Human)
Description:P28845
Residue:292
BDBM50356334
NameBDBM50356334
Synonyms:CHEMBL1911415
TypeSmall organic molecule
Emp. Form.C20H26O2
Mol. Mass.298.4192
SMILESOC(=O)CC1(CCc2ccccc2)C2CC3CC(C2)CC1C3