Reaction Details
TargetHigh affinity cAMP-specific and IBMX-insensitive 3',5'-cyclic phosphodiesterase 8A
LigandBDBM50356427
Substrate/Competitorn/a
Meas. Tech.ChEMBL_775547 (CHEMBL1913182)
IC50>1000±n/a nM
Citation Gewald, RRueger, CGrunwald, CEgerland, UHoefgen, N Synthesis and structure-activity relationship studies of dihydronaphthyridinediones as a novel structural class of potent and selective PDE7 inhibitors. Bioorg Med Chem Lett21:6652-6 (2011) 
 
High affinity cAMP-specific and IBMX-insensitive 3',5'-cyclic phosphodiesterase 8A
Name:High affinity cAMP-specific and IBMX-insensitive 3',5'-cyclic phosphodiesterase 8A
Type:Enzyme Catalytic Domain
Mol. Mass.:93295.89
Organism:Homo sapiens (Human)
Description:Recombinant catalytic domain (M1-E829) of human PDE8A.
Residue:829
BDBM50356427
NameBDBM50356427
Synonyms:CHEMBL1911559
TypeSmall organic molecule
Emp. Form.C26H22ClFN4O4
Mol. Mass.508.929
SMILESFc1cccc(Cl)c1Cn1cc(C(=O)Nc2ccc(cc2)N2CCOCC2)c(=O)c2[nH]c(=O)ccc12