Reaction Details
TargetHigh affinity cAMP-specific and IBMX-insensitive 3',5'-cyclic phosphodiesterase 8A
LigandBDBM50356428
Substrate/Competitorn/a
Meas. Tech.ChEMBL_775547 (CHEMBL1913182)
IC50>5000±n/a nM
Citation Gewald, RRueger, CGrunwald, CEgerland, UHoefgen, N Synthesis and structure-activity relationship studies of dihydronaphthyridinediones as a novel structural class of potent and selective PDE7 inhibitors. Bioorg Med Chem Lett21:6652-6 (2011) 
 
High affinity cAMP-specific and IBMX-insensitive 3',5'-cyclic phosphodiesterase 8A
Name:High affinity cAMP-specific and IBMX-insensitive 3',5'-cyclic phosphodiesterase 8A
Type:Enzyme Catalytic Domain
Mol. Mass.:93295.89
Organism:Homo sapiens (Human)
Description:Recombinant catalytic domain (M1-E829) of human PDE8A.
Residue:829
BDBM50356428
NameBDBM50356428
Synonyms:CHEMBL1911572
TypeSmall organic molecule
Emp. Form.C26H24ClFN4O3
Mol. Mass.494.945
SMILESCCN(CC)c1ccc(NC(=O)c2cn(Cc3c(F)cccc3Cl)c3ccc(=O)[nH]c3c2=O)cc1