Reaction Details
Target11-beta-hydroxysteroid dehydrogenase type 2
LigandBDBM50356448
Substrate/Competitorn/a
Meas. Tech.ChEMBL_775570 (CHEMBL1913254)
IC50 386±n/a nM
Citation Wu, SCYoon, DChin, Jvan Kirk, KSeethala, RGolla, RHe, BHarrity, TKunselman, LKMorgan, NNPonticiello, RPTaylor, JRZebo, RHarper, TWLi, WWang, MZhang, LSleczka, BGNayeem, ASheriff, SCamac, DMMorin, PEEverlof, JGLi, YXFerraro, CAKieltyka, KShou, WVath, MBZvyaga, TAGordon, DARobl, JA Discovery of 3-hydroxy-4-cyano-isoquinolines as novel, potent, and selective inhibitors of human 11ß-hydroxydehydrogenase 1 (11ß-HSD1). Bioorg Med Chem Lett21:6693-8 (2011) 
 
11-beta-hydroxysteroid dehydrogenase type 2
Name:11-beta-hydroxysteroid dehydrogenase type 2
Type:Enzyme
Mol. Mass.:44141.72
Organism:Homo sapiens (Human)
Description:Purified recombinant human 11beta-HSD2.
Residue:405
BDBM50356448
NameBDBM50356448
Synonyms:CHEMBL1911698
TypeSmall organic molecule
Emp. Form.C21H16N2OS
Mol. Mass.344.43
SMILESO=c1[nH]c(SCc2ccccc2)c2CCc3ccccc3-c2c1C#N