Reaction Details
TargetNitric oxide synthase, inducible
LigandBDBM50356484
Substrate/Competitorn/a
Meas. Tech.ChEMBL_775891 (CHEMBL1912864)
EC50 20±n/a nM
Citation Gahman, TCHerbert, MRLang, HThayer, ASymons, KTNguyen, PMMassari, MEDozier, SZhang, YSablad, MRao, TSNoble, SAShiau, AKHassig, CA Identification and SAR of selective inducible nitric oxide synthase (iNOS) dimerization inhibitors. Bioorg Med Chem Lett21:6888-94 (2011) 
 
Nitric oxide synthase, inducible
Name:Nitric oxide synthase, inducible
Type:Homodimer
Mol. Mass.:131141.95
Organism:Homo sapiens (Human)
Description:P35228
Residue:1153
BDBM50356484
NameBDBM50356484
Synonyms:CHEMBL1911981
TypeSmall organic molecule
Emp. Form.C20H23N5O2
Mol. Mass.365.4289
SMILESCc1cc(CCCCNCc2ccc3OCOc3c2)nc(n1)-n1ccnc1