Reaction Details
TargetNitric oxide synthase, inducible
LigandBDBM50356492
Substrate/Competitorn/a
Meas. Tech.ChEMBL_775891 (CHEMBL1912864)
EC50 71±n/a nM
Citation Gahman, TCHerbert, MRLang, HThayer, ASymons, KTNguyen, PMMassari, MEDozier, SZhang, YSablad, MRao, TSNoble, SAShiau, AKHassig, CA Identification and SAR of selective inducible nitric oxide synthase (iNOS) dimerization inhibitors. Bioorg Med Chem Lett21:6888-94 (2011) 
 
Nitric oxide synthase, inducible
Name:Nitric oxide synthase, inducible
Type:Homodimer
Mol. Mass.:131141.95
Organism:Homo sapiens (Human)
Description:P35228
Residue:1153
BDBM50356492
NameBDBM50356492
Synonyms:CHEMBL1912002
TypeSmall organic molecule
Emp. Form.C21H24N8O2S
Mol. Mass.452.533
SMILESCn1cnc(CN(CCCNCc2ccc3OCOc3c2)c2nc(ns2)-n2ccnc2)c1