Reaction Details
TargetBeta-secretase 1
LigandBDBM50356524
Substrate/Competitorn/a
Meas. Tech.ChEMBL_775964 (CHEMBL1912707)
IC50 3800±n/a nM
Citation Bertini, SAsso, VGhilardi, EGranchi, CManera, CMinutolo, FSaccomanni, GBortolato, AMason, JMoro, SMacchia, M Carbazole-containing arylcarboxamides as BACE1 inhibitors. Bioorg Med Chem Lett21:6657-61 (2011) 
 
Beta-secretase 1
Name:Beta-secretase 1
Type:Protein
Mol. Mass.:55755.10
Organism:Homo sapiens (Human)
Description:P56817
Residue:501
BDBM50356524
NameBDBM50356524
Synonyms:CHEMBL1909685
TypeSmall organic molecule
Emp. Form.C29H26N2O3
Mol. Mass.450.5283
SMILESCOc1ccc(cc1)C(=O)N(CC(O)Cn1c2ccccc2c2ccccc12)c1ccccc1