Reaction Details
TargetBeta-secretase 1
LigandBDBM50356517
Substrate/Competitorn/a
Meas. Tech.ChEMBL_775964 (CHEMBL1912707)
IC50>10000±n/a nM
Citation Bertini, SAsso, VGhilardi, EGranchi, CManera, CMinutolo, FSaccomanni, GBortolato, AMason, JMoro, SMacchia, M Carbazole-containing arylcarboxamides as BACE1 inhibitors. Bioorg Med Chem Lett21:6657-61 (2011) 
 
Beta-secretase 1
Name:Beta-secretase 1
Type:Protein
Mol. Mass.:55755.10
Organism:Homo sapiens (Human)
Description:P56817
Residue:501
BDBM50356517
NameBDBM50356517
Synonyms:CHEMBL1909697
TypeSmall organic molecule
Emp. Form.C30H28N2O2
Mol. Mass.448.5555
SMILESCc1ccc(CN(CC(O)Cn2c3ccccc3c3ccccc23)C(=O)c2ccccc2)cc1