Reaction Details
TargetBeta-secretase 1
LigandBDBM50356520
Substrate/Competitorn/a
Meas. Tech.ChEMBL_775964 (CHEMBL1912707)
IC50>10000±n/a nM
Citation Bertini, SAsso, VGhilardi, EGranchi, CManera, CMinutolo, FSaccomanni, GBortolato, AMason, JMoro, SMacchia, M Carbazole-containing arylcarboxamides as BACE1 inhibitors. Bioorg Med Chem Lett21:6657-61 (2011) 
 
Beta-secretase 1
Name:Beta-secretase 1
Type:Protein
Mol. Mass.:55755.10
Organism:Homo sapiens (Human)
Description:P56817
Residue:501
BDBM50356520
NameBDBM50356520
Synonyms:CHEMBL1909700
TypeSmall organic molecule
Emp. Form.C28H30N2O2
Mol. Mass.426.55
SMILESOC(CN(C1CCCCC1)C(=O)c1ccccc1)Cn1c2ccccc2c2ccccc12