Reaction Details
TargetCannabinoid receptor 1
LigandBDBM50356552
Substrate/Competitorn/a
Meas. Tech.ChEMBL_776030 (CHEMBL1912500)
Ki 15.3±n/a nM
Citation Piscitelli, FLigresti, ALa Regina, GGatti, VBrizzi, APasquini, SAllarà, MCarai, MANovellino, EColombo, GDi Marzo, VCorelli, FSilvestri, R 1-Aryl-5-(1H-pyrrol-1-yl)-1H-pyrazole-3-carboxamide: an effective scaffold for the design of either CB1 or CB2 receptor ligands. Eur J Med Chem46:5641-53 (2011) 
 
Cannabinoid receptor 1
Name:Cannabinoid receptor 1
Type:G Protein-Coupled Receptor (GPCR)
Mol. Mass.:52868.96
Organism:Homo sapiens (Human)
Description:P21554
Residue:472
BDBM50356552
NameBDBM50356552
Synonyms:CHEMBL1909860
TypeSmall organic molecule
Emp. Form.C22H24Cl2N4O
Mol. Mass.431.358
SMILESCCc1c(nn(c1-n1cccc1)-c1ccc(Cl)c(Cl)c1)C(=O)NC1CCCCC1