Reaction Details
TargetCannabinoid receptor 2
LigandBDBM50356537
Substrate/Competitorn/a
Meas. Tech.ChEMBL_776031 (CHEMBL1912501)
Ki 135.2±n/a nM
Citation Piscitelli, FLigresti, ALa Regina, GGatti, VBrizzi, APasquini, SAllarà, MCarai, MANovellino, EColombo, GDi Marzo, VCorelli, FSilvestri, R 1-Aryl-5-(1H-pyrrol-1-yl)-1H-pyrazole-3-carboxamide: an effective scaffold for the design of either CB1 or CB2 receptor ligands. Eur J Med Chem46:5641-53 (2011) 
 
Cannabinoid receptor 2
Name:Cannabinoid receptor 2
Type:G Protein-Coupled Receptor (GPCR)
Mol. Mass.:39690.94
Organism:Homo sapiens (Human)
Description:P34972
Residue:360
BDBM50356537
NameBDBM50356537
Synonyms:CHEMBL1909845
TypeSmall organic molecule
Emp. Form.C22H14Cl6N4O
Mol. Mass.563.091
SMILESCc1c(nn(c1-n1c(Cl)ccc1Cl)-c1ccc(Cl)cc1Cl)C(=O)NCc1ccc(Cl)c(Cl)c1