Reaction Details
TargetDipeptidyl peptidase 8
LigandBDBM50356589
Substrate/Competitorn/a
Meas. Tech.ChEMBL_776112 (CHEMBL1912808)
Ki 3477±n/a nM
Citation Wang, WDevasthale, PWang, AHarrity, TEgan, DMorgan, NCap, MFura, AKlei, HEKish, KWeigelt, CSun, LLevesque, PLi, YXZahler, RKirby, MSHamann, LG 7-Oxopyrrolopyridine-derived DPP4 inhibitors-mitigation of CYP and hERG liabilities via introduction of polar functionalities in the active site. Bioorg Med Chem Lett21:6646-51 (2011) 
 
Dipeptidyl peptidase 8
Name:Dipeptidyl peptidase 8
Type:Enzyme
Mol. Mass.:103342.62
Organism:Homo sapiens (Human)
Description:Q6V1X1
Residue:898
BDBM50356589
NameBDBM50356589
Synonyms:CHEMBL1910119
TypeSmall organic molecule
Emp. Form.C23H25Cl2N5O3
Mol. Mass.490.382
SMILESCc1nc2C(=O)N(CC(=O)N3CCC(CC3)C(N)=O)Cc2c(c1CN)-c1ccc(Cl)cc1Cl