Reaction Details
TargetDipeptidyl peptidase 4
LigandBDBM50356582
Substrate/Competitorn/a
Meas. Tech.ChEMBL_776111 (CHEMBL1912807)
Ki 0.26±n/a nM
Citation Wang, WDevasthale, PWang, AHarrity, TEgan, DMorgan, NCap, MFura, AKlei, HEKish, KWeigelt, CSun, LLevesque, PLi, YXZahler, RKirby, MSHamann, LG 7-Oxopyrrolopyridine-derived DPP4 inhibitors-mitigation of CYP and hERG liabilities via introduction of polar functionalities in the active site. Bioorg Med Chem Lett21:6646-51 (2011) 
 
Dipeptidyl peptidase 4
Name:Dipeptidyl peptidase 4
Type:Enzyme
Mol. Mass.:88271.01
Organism:Homo sapiens (Human)
Description:P27487
Residue:766
BDBM50356582
NameBDBM50356582
Synonyms:CHEMBL1910126
TypeSmall organic molecule
Emp. Form.C23H21Cl2N5O2
Mol. Mass.470.351
SMILESCc1nc2C(=O)N(CC(=O)NCc3cccnc3)Cc2c(c1CN)-c1ccc(Cl)cc1Cl