Reaction Details
TargetDipeptidyl peptidase 4
LigandBDBM50356587
Substrate/Competitorn/a
Meas. Tech.ChEMBL_776111 (CHEMBL1912807)
Ki 0.46±n/a nM
Citation Wang, WDevasthale, PWang, AHarrity, TEgan, DMorgan, NCap, MFura, AKlei, HEKish, KWeigelt, CSun, LLevesque, PLi, YXZahler, RKirby, MSHamann, LG 7-Oxopyrrolopyridine-derived DPP4 inhibitors-mitigation of CYP and hERG liabilities via introduction of polar functionalities in the active site. Bioorg Med Chem Lett21:6646-51 (2011) 
 
Dipeptidyl peptidase 4
Name:Dipeptidyl peptidase 4
Type:Enzyme
Mol. Mass.:88271.01
Organism:Homo sapiens (Human)
Description:P27487
Residue:766
BDBM50356587
NameBDBM50356587
Synonyms:CHEMBL1910121
TypeSmall organic molecule
Emp. Form.C22H25Cl2N5O4S
Mol. Mass.526.436
SMILESCc1nc2C(=O)N(CC(=O)N3CCN(CC3)S(C)(=O)=O)Cc2c(c1CN)-c1ccc(Cl)cc1Cl