Reaction Details
TargetAlpha-1D adrenergic receptor
LigandBDBM86708
Substrate/Competitorn/a
Meas. Tech.ChEMBL_774870 (CHEMBL1913212)
Ki 5±n/a nM
Citation Al Hussainy, RVerbeek, Jvan der Born, DBooij, JHerscheid, JK Design, synthesis and in vitro evaluation of bridgehead fluoromethyl analogs of N-{2-[4-(2-methoxyphenyl)piperazin-1-yl]ethyl}-N-(pyridin-2-yl)cyclohexanecarboxamide (WAY-100635) for the 5-HT(1A) receptor. Eur J Med Chem46:5728-35 (2011) 
 
Alpha-1D adrenergic receptor
Name:Alpha-1D adrenergic receptor
Type:Enzyme Catalytic Domain
Mol. Mass.:60485.82
Organism:Homo sapiens (Human)
Description:adrenergic Alpha1D ADRA1D HUMAN::P25100
Residue:572
BDBM86708
NameBDBM86708
Synonyms:CAS_146714-97-8 CHEMBL514874 NSC_104911 | WAY 100,635
TypeSmall organic molecule
Emp. Form.C25H34N4O2
Mol. Mass.422.5631
SMILESCOc1ccccc1N1CCN(CCN(C(=O)C2CCCCC2)c2ccccn2)CC1