Reaction Details
TargetSodium-dependent dopamine transporter
LigandBDBM50451132
Substrate/Competitorn/a
Meas. Tech.ChEMBL_785530 (CHEMBL1920093)
Ki 15±n/a nM
Citation Liu, JZhu, LPlössl, KLieberman, BPKung, HF Synthesis and evaluation of novel N-fluoropyridyl derivatives of tropane as potential PET imaging agents for the dopamine transporter. Bioorg Med Chem Lett21:2962-5 (2011) 
 
Sodium-dependent dopamine transporter
Name:Sodium-dependent dopamine transporter
Type:Multi-pass membrane protein
Mol. Mass.:68497.11
Organism:Homo sapiens (Human)
Description:Q01959
Residue:620
BDBM50451132
NameBDBM50451132
Synonyms:CHEMBL2079586 | WIN-35428
TypeSmall organic molecule
Emp. Form.C16H20FNO2
Mol. Mass.277.3339
SMILES[H][C@@]12CC[C@]([H])([C@H]([C@H](C1)c1ccc(F)cc1)C(=O)OC)N2C