Reaction Details
TargetSodium-dependent serotonin transporter
LigandBDBM50356627
Substrate/Competitorn/a
Meas. Tech.ChEMBL_785531 (CHEMBL1920094)
Ki 11±n/a nM
Citation Liu, JZhu, LPlössl, KLieberman, BPKung, HF Synthesis and evaluation of novel N-fluoropyridyl derivatives of tropane as potential PET imaging agents for the dopamine transporter. Bioorg Med Chem Lett21:2962-5 (2011) 
 
Sodium-dependent serotonin transporter
Name:Sodium-dependent serotonin transporter
Type:Multi-pass membrane protein
Mol. Mass.:70322.51
Organism:Homo sapiens (Human)
Description:P31645
Residue:630
BDBM50356627
NameBDBM50356627
Synonyms:CHEMBL1914698
TypeSmall organic molecule
Emp. Form.C20H23BrClN3
Mol. Mass.420.774
SMILESCN1C2CCC1[C@@H](CNc1ccnc(Br)c1)[C@H](C2)c1ccc(Cl)cc1