Reaction Details
TargetSodium-dependent dopamine transporter
LigandBDBM50156916
Substrate/Competitorn/a
Meas. Tech.ChEMBL_785530 (CHEMBL1920093)
Ki 3.5±n/a nM
Citation Liu, JZhu, LPlössl, KLieberman, BPKung, HF Synthesis and evaluation of novel N-fluoropyridyl derivatives of tropane as potential PET imaging agents for the dopamine transporter. Bioorg Med Chem Lett21:2962-5 (2011) 
 
Sodium-dependent dopamine transporter
Name:Sodium-dependent dopamine transporter
Type:Multi-pass membrane protein
Mol. Mass.:68497.11
Organism:Homo sapiens (Human)
Description:Q01959
Residue:620
BDBM50156916
NameBDBM50156916
Synonyms:(1R)-3beta-(4-bromophenyl)tropane-2beta-carboxylicacid methyl ester CHEMBL218082
TypeSmall organic molecule
Emp. Form.C16H20BrNO2
Mol. Mass.338.24
SMILESCOC(=O)[C@@H]1C2CCC(C[C@@H]1c1ccc(Br)cc1)N2C