Reaction Details
TargetHistone deacetylase 11
LigandBDBM19130
Substrate/Competitorn/a
Meas. Tech.ChEMBL_785877 (CHEMBL1921146)
IC50 14±n/a nM
Citation Neelarapu, RHolzle, DLVelaparthi, SBai, HBrunsteiner, MBlond, SYPetukhov, PA Design, synthesis, docking, and biological evaluation of novel diazide-containing isoxazole- and pyrazole-based histone deacetylase probes. J Med Chem54:4350-64 (2011) 
 
Histone deacetylase 11
Name:Histone deacetylase 11
Type:Chromatin regulator; hydrolase; repressor
Mol. Mass.:39187.66
Organism:Homo sapiens (Human)
Description:Q96DB2
Residue:347
BDBM19130
NameBDBM19130
Synonyms:(2E,4E,6R)-7-[4-(dimethylamino)phenyl]-N-hydroxy-4,6-dimethyl-7-oxohepta-2,4-dienamide TSA | Trichostatin A (TSA)
TypeSmall organic molecule
Emp. Form.C17H22N2O3
Mol. Mass.302.3682
SMILESCC(C=CC(=O)NO)C=C(C)C(=O)c1ccc(cc1)N(C)C