Reaction Details
TargetInterstitial collagenase
LigandBDBM50062351
Substrate/Competitorn/a
Meas. Tech.ChEMBL_785748 (CHEMBL1920768)
IC50 0.20±n/a nM
Citation Neelarapu, RHolzle, DLVelaparthi, SBai, HBrunsteiner, MBlond, SYPetukhov, PA Design, synthesis, docking, and biological evaluation of novel diazide-containing isoxazole- and pyrazole-based histone deacetylase probes. J Med Chem54:4350-64 (2011) 
 
Interstitial collagenase
Name:Interstitial collagenase
Type:Enzyme
Mol. Mass.:54010.26
Organism:Homo sapiens (Human)
Description: P03956
Residue:469
BDBM50062351
NameBDBM50062351
Synonyms:(R)-N*4*-Hydroxy-N*1*-[(S)-2-(1H-indol-3-yl)-1-methylcarbamoyl-ethyl]-2-isobutyl-succinamide (R)-N1-((S)-3-(1H-indol-3-yl)-1-(methylamino)-1-oxopropan-2-yl)-N4-hydroxy-2-isobutylsuccinamide CHEMBL19611 US9487462, ilomastat
TypeSmall organic molecule
Emp. Form.C20H28N4O4
Mol. Mass.388.4607
SMILESCNC(=O)[C@H](Cc1c[nH]c2ccccc12)NC(=O)[C@H](CC(C)C)CC(=O)NO