Reaction Details
TargetHistone deacetylase 3/Nuclear receptor corepressor 2 (HDAC3/NCoR2)
LigandBDBM50356639
Substrate/Competitorn/a
Meas. Tech.ChEMBL_785888 (CHEMBL1921157)
IC50 22±n/a nM
Citation Neelarapu, RHolzle, DLVelaparthi, SBai, HBrunsteiner, MBlond, SYPetukhov, PA Design, synthesis, docking, and biological evaluation of novel diazide-containing isoxazole- and pyrazole-based histone deacetylase probes. J Med Chem54:4350-64 (2011) 
 
Histone deacetylase 3/Nuclear receptor corepressor 2 (HDAC3/NCoR2)
Name:Histone deacetylase 3/Nuclear receptor corepressor 2 (HDAC3/NCoR2)
Type:n/a
Mol. Mass.:n/a
Description:ASSAY_ID of ChEMBL is 2146499
Components:This complex has 2 components.
Component 1
Name:Histone deacetylase 3
Synonyms:HD3 HDAC3_HUMAN Human HDAC3 SMAP45
Type:Enzyme
Mol. Mass.:48829.55
Organism:Homo sapiens (Human)
Description:O15379
Residue:428
Component 2
Name:Nuclear receptor corepressor 2
Synonyms:CTG repeat protein 26 Histone deacetylase 2/Nuclear receptor corepressor 2 NCOR2 Nuclear receptor corepressor 2 SMAP270 Silencing mediator of retinoic acid and thyroid hormone receptor TRAC | Thyroid-, retinoic-acid-receptor-associated corepressor
Type:Enzyme
Mol. Mass.:274839.59
Organism:Homo sapiens (Human)
Description:Q9Y618
Residue:2514
BDBM50356639
NameBDBM50356639
Synonyms:CHEMBL1914705
TypeSmall organic molecule
Emp. Form.C18H23N7O3
Mol. Mass.385.4203
SMILESONC(=O)CCCCCCC(=O)Nc1cnn(Cc2ccc(cc2)N=[N+]=[N-])c1